{"text_format":"1","workbook":"xlsx","n_sheets":9,"sheets":["Request","Additional Action 1","Additional Action 2","Additional Action 3","Unused Vaca Days Calculations","Partial Month Calculation","All Data","Helpful Hints - All","Drop Downs"],"not_rendered":{"charts":0,"images":0,"macros":1,"external_links":0,"defined_names":6,"comments":0,"pivot_tables":0},"unopened":[],"bounds":{"document_bytes":16777216,"sheet_cells":100000,"rows_first":2000,"rows_last":500,"rows_between":2000,"halvings":0,"cell_chars":16384,"cell_head_chars":4096},"cells_cut":0,"cells_raw":0,"read":"whole","date_system":"1900"}

{"sheet":"Request","index":0,"n_rows":78,"n_cols":8,"rows_kept":78,"cut":false,"hidden":false,"merged":[[74,3,74,4],[75,3,75,4],[76,3,76,4],[68,3,68,4],[69,3,69,4],[70,3,70,4],[71,3,71,4],[72,3,72,4],[73,3,73,4],[60,3,60,4],[61,3,61,4],[64,3,64,4],[66,3,66,4],[67,3,67,4],[59,3,59,4],[48,3,48,4],[49,3,49,4],[50,3,50,4],[51,3,51,4],[52,3,52,4],[53,3,53,4],[54,3,54,4],[55,3,55,4],[56,3,56,4],[57,3,57,4],[58,3,58,4],[47,3,47,4],[37,3,37,4],[38,3,38,4],[39,3,39,4],[40,3,40,4],[41,3,41,4],[42,3,42,4],[43,3,43,4],[44,3,44,4],[45,3,45,4],[46,3,46,4],[35,3,35,4],[21,3,21,4],[22,3,22,4],[23,3,23,4],[24,3,24,4],[25,3,25,4],[27,3,27,4],[28,3,28,4],[29,3,29,4],[32,3,32,4],[33,3,33,4],[34,3,34,4],[30,0,31,0],[30,1,31,1],[30,2,31,2],[30,3,31,3],[0,3,0,4],[1,3,1,4],[2,3,2,4],[3,3,3,4],[4,3,4,4],[20,3,20,4],[9,3,9,4],[10,3,10,4],[11,3,11,4],[12,3,12,4],[13,3,13,4],[14,3,14,4],[30,5,31,5],[5,3,5,4],[6,3,6,4],[7,3,7,4],[8,3,8,4],[15,3,15,4],[16,3,16,4],[17,3,17,4],[18,3,18,4],[19,3,19,4],[26,3,26,4]]}
[null,null,null,null,null,"V8.1.25"]
[null,"Select an Action:","Revision?","Add Additional Action information to Tab 2"]
[null,"Select An Action","No","List Additional Actions Here: "]
[]
[null,"Category","Required?","Details",null,"Helpful Hints"]
[null,"Effective Date",{"$f":"_xlfn.IFNA(VLOOKUP(CONCATENATE($B$3,B6),'All Data'!$B:$D,3,FALSE),\"No\")","v":"No"},null,null,{"$f":"_xlfn.IFNA(VLOOKUP(CONCATENATE($B$3,B6),'Helpful Hints - All'!$C$1:$D$1019,2,FALSE),\" \")","v":" "}]
[null,"Last Name",{"$f":"_xlfn.IFNA(VLOOKUP(CONCATENATE($B$3,B7),'All Data'!$B:$D,3,FALSE),\"No\")","v":"No"},null,null,{"$f":"_xlfn.IFNA(VLOOKUP(CONCATENATE($B$3,B7),'Helpful Hints - All'!$C$1:$D$1019,2,FALSE),\" \")","v":" "}]
[null,"First Name",{"$f":"_xlfn.IFNA(VLOOKUP(CONCATENATE($B$3,B8),'All Data'!$B:$D,3,FALSE),\"No\")","v":"No"},null,null,{"$f":"_xlfn.IFNA(VLOOKUP(CONCATENATE($B$3,B8),'Helpful Hints - All'!$C$1:$D$1019,2,FALSE),\" \")","v":" "}]
[null,"Middle Initial",{"$f":"_xlfn.IFNA(VLOOKUP(CONCATENATE($B$3,B9),'All Data'!$B:$D,3,FALSE),\"No\")","v":"No"},null,null,{"$f":"_xlfn.IFNA(VLOOKUP(CONCATENATE($B$3,B9),'Helpful Hints - All'!$C$1:$D$1019,2,FALSE),\" \")","v":" "}]
[null,"Preferred Last Name",{"$f":"_xlfn.IFNA(VLOOKUP(CONCATENATE($B$3,B10),'All Data'!$B:$D,3,FALSE),\"No\")","v":"No"},null,null,{"$f":"_xlfn.IFNA(VLOOKUP(CONCATENATE($B$3,B10),'Helpful Hints - All'!$C$1:$D$1019,2,FALSE),\" \")","v":" "}]
[null,"Preferred First Name",{"$f":"_xlfn.IFNA(VLOOKUP(CONCATENATE($B$3,B11),'All Data'!$B:$D,3,FALSE),\"No\")","v":"No"},null,null,{"$f":"_xlfn.IFNA(VLOOKUP(CONCATENATE($B$3,B11),'Helpful Hints - All'!$C$1:$D$1019,2,FALSE),\" \")","v":" "}]
[null,"Preferred Middle Initial",{"$f":"_xlfn.IFNA(VLOOKUP(CONCATENATE($B$3,B12),'All Data'!$B:$D,3,FALSE),\"No\")","v":"No"},null,null,{"$f":"_xlfn.IFNA(VLOOKUP(CONCATENATE($B$3,B12),'Helpful Hints - All'!$C$1:$D$1019,2,FALSE),\" \")","v":" "}]
[null,"Is this a Graduate Student?",{"$f":"_xlfn.IFNA(VLOOKUP(CONCATENATE($B$3,B13),'All Data'!$B:$D,3,FALSE),\"No\")","v":"No"},null,null,"Assignments for students need to have start and end dates.  Use monthly salary unless partial month payment, then use exact pay amount for that month; see Partial Month Calculation tab for calc formula"]
[null,"Gender",{"$f":"_xlfn.IFNA(VLOOKUP(CONCATENATE($B$3,B14),'All Data'!$B:$D,3,FALSE),\"No\")","v":"No"}]
[null,"Hinman Box",{"$f":"_xlfn.IFNA(VLOOKUP(CONCATENATE($B$3,B15),'All Data'!$B:$D,3,FALSE),\"No\")","v":"No"},null,null,{"$f":"_xlfn.IFNA(VLOOKUP(CONCATENATE($B$3,B15),'Helpful Hints - All'!$C$1:$D$1019,2,FALSE),\" \")","v":" "}]
{"$rows_left_out":64}
{"sheet":"Additional Action 1","index":1,"n_rows":78,"n_cols":8,"rows_kept":78,"cut":false,"hidden":false,"merged":[[72,3,72,4],[73,3,73,4],[74,3,74,4],[75,3,75,4],[66,3,66,4],[67,3,67,4],[68,3,68,4],[69,3,69,4],[70,3,70,4],[71,3,71,4],[64,3,64,4],[52,3,52,4],[53,3,53,4],[54,3,54,4],[55,3,55,4],[56,3,56,4],[57,3,57,4],[58,3,58,4],[59,3,59,4],[60,3,60,4],[61,3,61,4],[63,3,63,4],[51,3,51,4],[40,3,40,4],[41,3,41,4],[42,3,42,4],[43,3,43,4],[44,3,44,4],[45,3,45,4],[46,3,46,4],[47,3,47,4],[48,3,48,4],[49,3,49,4],[50,3,50,4],[39,3,39,4],[24,3,24,4],[25,3,25,4],[27,3,27,4],[28,3,28,4],[29,3,29,4],[32,3,32,4],[33,3,33,4],[34,3,34,4],[35,3,35,4],[37,3,37,4],[38,3,38,4],[26,3,26,4],[23,3,23,4],[12,3,12,4],[13,3,13,4],[14,3,14,4],[15,3,15,4],[16,3,16,4],[17,3,17,4],[18,3,18,4],[19,3,19,4],[20,3,20,4],[21,3,21,4],[22,3,22,4],[11,3,11,4],[0,3,0,4],[1,3,1,4],[2,3,2,4],[3,3,3,4],[4,3,4,4],[5,3,5,4],[6,3,6,4],[7,3,7,4],[8,3,8,4],[9,3,9,4],[10,3,10,4],[30,0,31,0],[30,1,31,1],[30,2,31,2],[30,3,31,3],[30,5,31,5]]}
[]
[null,"Select an Action:","Revision?","Add Additional Action information to Tab 3"]
[null,"Select An Action","No","List Additional Actions Here: "]
[]
[null,"Category","Required?","Details",null,"Helpful Hints"]
[null,"Effective Date",{"$f":"_xlfn.IFNA(VLOOKUP(CONCATENATE($B$3,B6),'All Data'!$B:$D,3,FALSE),\"No\")","v":"No"},null,null,{"$f":"_xlfn.IFNA(VLOOKUP(CONCATENATE($B$3,B6),'Helpful Hints - All'!$C$1:$D$1019,2,FALSE),\" \")","v":" "}]
[null,"Last Name",{"$f":"_xlfn.IFNA(VLOOKUP(CONCATENATE($B$3,B7),'All Data'!$B:$D,3,FALSE),\"No\")","v":"No"},{"$f":"IF(Request!$D7=\"\",\"\",Request!$D7)","v":""},null,{"$f":"_xlfn.IFNA(VLOOKUP(CONCATENATE($B$3,B7),'Helpful Hints - All'!$C$1:$D$1019,2,FALSE),\" \")","v":" "}]
[null,"First Name",{"$f":"_xlfn.IFNA(VLOOKUP(CONCATENATE($B$3,B8),'All Data'!$B:$D,3,FALSE),\"No\")","v":"No"},{"$f":"IF(Request!$D8=\"\",\"\",Request!$D8)","v":""},null,{"$f":"_xlfn.IFNA(VLOOKUP(CONCATENATE($B$3,B8),'Helpful Hints - All'!$C$1:$D$1019,2,FALSE),\" \")","v":" "}]
[null,"Middle Initial",{"$f":"_xlfn.IFNA(VLOOKUP(CONCATENATE($B$3,B9),'All Data'!$B:$D,3,FALSE),\"No\")","v":"No"},{"$f":"IF(Request!$D9=\"\",\"\",Request!$D9)","v":""},null,{"$f":"_xlfn.IFNA(VLOOKUP(CONCATENATE($B$3,B9),'Helpful Hints - All'!$C$1:$D$1019,2,FALSE),\" \")","v":" "}]
[null,"Preferred Last Name",{"$f":"_xlfn.IFNA(VLOOKUP(CONCATENATE($B$3,B10),'All Data'!$B:$D,3,FALSE),\"No\")","v":"No"},{"$f":"IF(Request!$D10=\"\",\"\",Request!$D10)","v":""},null,{"$f":"_xlfn.IFNA(VLOOKUP(CONCATENATE($B$3,B10),'Helpful Hints - All'!$C$1:$D$1019,2,FALSE),\" \")","v":" "}]
[null,"Preferred First Name",{"$f":"_xlfn.IFNA(VLOOKUP(CONCATENATE($B$3,B11),'All Data'!$B:$D,3,FALSE),\"No\")","v":"No"},{"$f":"IF(Request!$D11=\"\",\"\",Request!$D11)","v":""},null,{"$f":"_xlfn.IFNA(VLOOKUP(CONCATENATE($B$3,B11),'Helpful Hints - All'!$C$1:$D$1019,2,FALSE),\" \")","v":" "}]
[null,"Preferred Middle Initial",{"$f":"_xlfn.IFNA(VLOOKUP(CONCATENATE($B$3,B12),'All Data'!$B:$D,3,FALSE),\"No\")","v":"No"},{"$f":"IF(Request!$D12=\"\",\"\",Request!$D12)","v":""},null,{"$f":"_xlfn.IFNA(VLOOKUP(CONCATENATE($B$3,B12),'Helpful Hints - All'!$C$1:$D$1019,2,FALSE),\" \")","v":" "}]
[null,"Is this a Graduate Student?",{"$f":"_xlfn.IFNA(VLOOKUP(CONCATENATE($B$3,B13),'All Data'!$B:$D,3,FALSE),\"No\")","v":"No"},{"$f":"IF(Request!$D13=\"\",\"\",Request!$D13)","v":""},null,"Assignments for students need to have start and end dates.  Use monthly salary unless partial month payment, then use exact pay amount for that month; see Partial Month Calculation tab for calc formula"]
[null,"Gender",{"$f":"_xlfn.IFNA(VLOOKUP(CONCATENATE($B$3,B14),'All Data'!$B:$D,3,FALSE),\"No\")","v":"No"},{"$f":"IF(Request!$D14=\"\",\"\",Request!$D14)","v":""}]
[null,"Hinman Box",{"$f":"_xlfn.IFNA(VLOOKUP(CONCATENATE($B$3,B15),'All Data'!$B:$D,3,FALSE),\"No\")","v":"No"},{"$f":"IF(Request!$D15=\"\",\"\",Request!$D15)","v":""},null,{"$f":"_xlfn.IFNA(VLOOKUP(CONCATENATE($B$3,B15),'Helpful Hints - All'!$C$1:$D$1019,2,FALSE),\" \")","v":" "}]
{"$rows_left_out":64}
{"sheet":"Additional Action 2","index":2,"n_rows":78,"n_cols":8,"rows_kept":78,"cut":false,"hidden":false,"merged":[[71,3,71,4],[72,3,72,4],[73,3,73,4],[74,3,74,4],[66,3,66,4],[67,3,67,4],[68,3,68,4],[69,3,69,4],[70,3,70,4],[48,3,48,4],[49,3,49,4],[63,3,63,4],[51,3,51,4],[52,3,52,4],[53,3,53,4],[54,3,54,4],[55,3,55,4],[56,3,56,4],[61,3,61,4],[57,3,57,4],[58,3,58,4],[59,3,59,4],[60,3,60,4],[19,3,19,4],[20,3,20,4],[21,3,21,4],[22,3,22,4],[38,3,38,4],[24,3,24,4],[25,3,25,4],[27,3,27,4],[28,3,28,4],[29,3,29,4],[35,3,35,4],[32,3,32,4],[33,3,33,4],[34,3,34,4],[37,3,37,4],[26,3,26,4],[14,3,14,4],[15,3,15,4],[16,3,16,4],[17,3,17,4],[18,3,18,4],[30,5,31,5],[11,3,11,4],[0,3,0,4],[1,3,1,4],[2,3,2,4],[3,3,3,4],[4,3,4,4],[5,3,5,4],[6,3,6,4],[7,3,7,4],[8,3,8,4],[9,3,9,4],[10,3,10,4],[23,3,23,4],[12,3,12,4],[13,3,13,4],[64,3,64,4],[75,3,75,4],[30,0,31,0],[30,1,31,1],[30,2,31,2],[30,3,31,3],[50,3,50,4],[39,3,39,4],[40,3,40,4],[41,3,41,4],[42,3,42,4],[43,3,43,4],[44,3,44,4],[45,3,45,4],[46,3,46,4],[47,3,47,4]]}
[]
[null,"Select an Action:","Revision?","Add Additional Action information to Tab 4"]
[null,"Select An Action","No","List Additional Actions Here: "]
[]
[null,"Category","Required?","Details",null,"Helpful Hints"]
[null,"Effective Date",{"$f":"_xlfn.IFNA(VLOOKUP(CONCATENATE($B$3,B6),'All Data'!$B:$D,3,FALSE),\"No\")","v":"No"},null,null,{"$f":"_xlfn.IFNA(VLOOKUP(CONCATENATE($B$3,B6),'Helpful Hints - All'!$C$1:$D$1019,2,FALSE),\" \")","v":" "}]
[null,"Last Name",{"$f":"_xlfn.IFNA(VLOOKUP(CONCATENATE($B$3,B7),'All Data'!$B:$D,3,FALSE),\"No\")","v":"No"},{"$f":"IF(Request!$D7=\"\",\"\",Request!$D7)","v":""},null,{"$f":"_xlfn.IFNA(VLOOKUP(CONCATENATE($B$3,B7),'Helpful Hints - All'!$C$1:$D$1019,2,FALSE),\" \")","v":" "}]
[null,"First Name",{"$f":"_xlfn.IFNA(VLOOKUP(CONCATENATE($B$3,B8),'All Data'!$B:$D,3,FALSE),\"No\")","v":"No"},{"$f":"IF(Request!$D8=\"\",\"\",Request!$D8)","v":""},null,{"$f":"_xlfn.IFNA(VLOOKUP(CONCATENATE($B$3,B8),'Helpful Hints - All'!$C$1:$D$1019,2,FALSE),\" \")","v":" "}]
[null,"Middle Initial",{"$f":"_xlfn.IFNA(VLOOKUP(CONCATENATE($B$3,B9),'All Data'!$B:$D,3,FALSE),\"No\")","v":"No"},{"$f":"IF(Request!$D9=\"\",\"\",Request!$D9)","v":""},null,{"$f":"_xlfn.IFNA(VLOOKUP(CONCATENATE($B$3,B9),'Helpful Hints - All'!$C$1:$D$1019,2,FALSE),\" \")","v":" "}]
[null,"Preferred Last Name",{"$f":"_xlfn.IFNA(VLOOKUP(CONCATENATE($B$3,B10),'All Data'!$B:$D,3,FALSE),\"No\")","v":"No"},{"$f":"IF(Request!$D10=\"\",\"\",Request!$D10)","v":""},null,{"$f":"_xlfn.IFNA(VLOOKUP(CONCATENATE($B$3,B10),'Helpful Hints - All'!$C$1:$D$1019,2,FALSE),\" \")","v":" "}]
[null,"Preferred First Name",{"$f":"_xlfn.IFNA(VLOOKUP(CONCATENATE($B$3,B11),'All Data'!$B:$D,3,FALSE),\"No\")","v":"No"},{"$f":"IF(Request!$D11=\"\",\"\",Request!$D11)","v":""},null,{"$f":"_xlfn.IFNA(VLOOKUP(CONCATENATE($B$3,B11),'Helpful Hints - All'!$C$1:$D$1019,2,FALSE),\" \")","v":" "}]
[null,"Preferred Middle Initial",{"$f":"_xlfn.IFNA(VLOOKUP(CONCATENATE($B$3,B12),'All Data'!$B:$D,3,FALSE),\"No\")","v":"No"},{"$f":"IF(Request!$D12=\"\",\"\",Request!$D12)","v":""},null,{"$f":"_xlfn.IFNA(VLOOKUP(CONCATENATE($B$3,B12),'Helpful Hints - All'!$C$1:$D$1019,2,FALSE),\" \")","v":" "}]
[null,"Is this a Graduate Student?",{"$f":"_xlfn.IFNA(VLOOKUP(CONCATENATE($B$3,B13),'All Data'!$B:$D,3,FALSE),\"No\")","v":"No"},{"$f":"IF(Request!$D13=\"\",\"\",Request!$D13)","v":""},null,"Assignments for students need to have start and end dates.  Use monthly salary unless partial month payment, then use exact pay amount for that month; see Partial Month Calculation tab for calc formula"]
[null,"Gender",{"$f":"_xlfn.IFNA(VLOOKUP(CONCATENATE($B$3,B14),'All Data'!$B:$D,3,FALSE),\"No\")","v":"No"},{"$f":"IF(Request!$D14=\"\",\"\",Request!$D14)","v":""}]
[null,"Hinman Box",{"$f":"_xlfn.IFNA(VLOOKUP(CONCATENATE($B$3,B15),'All Data'!$B:$D,3,FALSE),\"No\")","v":"No"},{"$f":"IF(Request!$D15=\"\",\"\",Request!$D15)","v":""},null,{"$f":"_xlfn.IFNA(VLOOKUP(CONCATENATE($B$3,B15),'Helpful Hints - All'!$C$1:$D$1019,2,FALSE),\" \")","v":" "}]
{"$rows_left_out":64}
{"sheet":"Additional Action 3","index":3,"n_rows":78,"n_cols":8,"rows_kept":78,"cut":false,"hidden":false,"merged":[[71,3,71,4],[72,3,72,4],[73,3,73,4],[74,3,74,4],[66,3,66,4],[67,3,67,4],[68,3,68,4],[69,3,69,4],[70,3,70,4],[48,3,48,4],[49,3,49,4],[63,3,63,4],[51,3,51,4],[52,3,52,4],[53,3,53,4],[54,3,54,4],[55,3,55,4],[56,3,56,4],[61,3,61,4],[57,3,57,4],[58,3,58,4],[59,3,59,4],[60,3,60,4],[19,3,19,4],[20,3,20,4],[21,3,21,4],[22,3,22,4],[38,3,38,4],[24,3,24,4],[25,3,25,4],[27,3,27,4],[28,3,28,4],[29,3,29,4],[35,3,35,4],[32,3,32,4],[33,3,33,4],[34,3,34,4],[37,3,37,4],[26,3,26,4],[14,3,14,4],[15,3,15,4],[16,3,16,4],[17,3,17,4],[18,3,18,4],[30,5,31,5],[11,3,11,4],[0,3,0,4],[1,3,1,4],[2,3,2,4],[3,3,3,4],[4,3,4,4],[5,3,5,4],[6,3,6,4],[7,3,7,4],[8,3,8,4],[9,3,9,4],[10,3,10,4],[23,3,23,4],[12,3,12,4],[13,3,13,4],[64,3,64,4],[75,3,75,4],[30,0,31,0],[30,1,31,1],[30,2,31,2],[30,3,31,3],[50,3,50,4],[39,3,39,4],[40,3,40,4],[41,3,41,4],[42,3,42,4],[43,3,43,4],[44,3,44,4],[45,3,45,4],[46,3,46,4],[47,3,47,4]]}
[]
[null,"Select an Action:","Revision?","Add Additional Action information to Tab 5"]
[null,"Select An Action","No","List Additional Actions Here: "]
[]
[null,"Category","Required?","Details",null,"Helpful Hints"]
[null,"Effective Date",{"$f":"_xlfn.IFNA(VLOOKUP(CONCATENATE($B$3,B6),'All Data'!$B:$D,3,FALSE),\"No\")","v":"No"},null,null,{"$f":"_xlfn.IFNA(VLOOKUP(CONCATENATE($B$3,B6),'Helpful Hints - All'!$C$1:$D$1019,2,FALSE),\" \")","v":" "}]
[null,"Last Name",{"$f":"_xlfn.IFNA(VLOOKUP(CONCATENATE($B$3,B7),'All Data'!$B:$D,3,FALSE),\"No\")","v":"No"},{"$f":"IF(Request!$D7=\"\",\"\",Request!$D7)","v":""},null,{"$f":"_xlfn.IFNA(VLOOKUP(CONCATENATE($B$3,B7),'Helpful Hints - All'!$C$1:$D$1019,2,FALSE),\" \")","v":" "}]
[null,"First Name",{"$f":"_xlfn.IFNA(VLOOKUP(CONCATENATE($B$3,B8),'All Data'!$B:$D,3,FALSE),\"No\")","v":"No"},{"$f":"IF(Request!$D8=\"\",\"\",Request!$D8)","v":""},null,{"$f":"_xlfn.IFNA(VLOOKUP(CONCATENATE($B$3,B8),'Helpful Hints - All'!$C$1:$D$1019,2,FALSE),\" \")","v":" "}]
[null,"Middle Initial",{"$f":"_xlfn.IFNA(VLOOKUP(CONCATENATE($B$3,B9),'All Data'!$B:$D,3,FALSE),\"No\")","v":"No"},{"$f":"IF(Request!$D9=\"\",\"\",Request!$D9)","v":""},null,{"$f":"_xlfn.IFNA(VLOOKUP(CONCATENATE($B$3,B9),'Helpful Hints - All'!$C$1:$D$1019,2,FALSE),\" \")","v":" "}]
[null,"Preferred Last Name",{"$f":"_xlfn.IFNA(VLOOKUP(CONCATENATE($B$3,B10),'All Data'!$B:$D,3,FALSE),\"No\")","v":"No"},{"$f":"IF(Request!$D10=\"\",\"\",Request!$D10)","v":""},null,{"$f":"_xlfn.IFNA(VLOOKUP(CONCATENATE($B$3,B10),'Helpful Hints - All'!$C$1:$D$1019,2,FALSE),\" \")","v":" "}]
[null,"Preferred First Name",{"$f":"_xlfn.IFNA(VLOOKUP(CONCATENATE($B$3,B11),'All Data'!$B:$D,3,FALSE),\"No\")","v":"No"},{"$f":"IF(Request!$D11=\"\",\"\",Request!$D11)","v":""},null,{"$f":"_xlfn.IFNA(VLOOKUP(CONCATENATE($B$3,B11),'Helpful Hints - All'!$C$1:$D$1019,2,FALSE),\" \")","v":" "}]
[null,"Preferred Middle Initial",{"$f":"_xlfn.IFNA(VLOOKUP(CONCATENATE($B$3,B12),'All Data'!$B:$D,3,FALSE),\"No\")","v":"No"},{"$f":"IF(Request!$D12=\"\",\"\",Request!$D12)","v":""},null,{"$f":"_xlfn.IFNA(VLOOKUP(CONCATENATE($B$3,B12),'Helpful Hints - All'!$C$1:$D$1019,2,FALSE),\" \")","v":" "}]
[null,"Is this a Graduate Student?",{"$f":"_xlfn.IFNA(VLOOKUP(CONCATENATE($B$3,B13),'All Data'!$B:$D,3,FALSE),\"No\")","v":"No"},{"$f":"IF(Request!$D13=\"\",\"\",Request!$D13)","v":""},null,"Assignments for students need to have start and end dates.  Use monthly salary unless partial month payment, then use exact pay amount for that month; see Partial Month Calculation tab for calc formula"]
[null,"Gender",{"$f":"_xlfn.IFNA(VLOOKUP(CONCATENATE($B$3,B14),'All Data'!$B:$D,3,FALSE),\"No\")","v":"No"},{"$f":"IF(Request!$D14=\"\",\"\",Request!$D14)","v":""}]
[null,"Hinman Box",{"$f":"_xlfn.IFNA(VLOOKUP(CONCATENATE($B$3,B15),'All Data'!$B:$D,3,FALSE),\"No\")","v":"No"},{"$f":"IF(Request!$D15=\"\",\"\",Request!$D15)","v":""},null,{"$f":"_xlfn.IFNA(VLOOKUP(CONCATENATE($B$3,B15),'Helpful Hints - All'!$C$1:$D$1019,2,FALSE),\" \")","v":" "}]
{"$rows_left_out":64}
{"sheet":"Unused Vaca Days Calculations","index":4,"n_rows":9,"n_cols":1,"rows_kept":9,"cut":false,"hidden":false,"merged":[]}
["Unused Vacation Days Calculation (Exempt): "]
["Please enter the number of unused days remaining from this year’s allotment of available days. "]
["For example, a full time person has 22 days available and used 10 so enter 12 as unused*. "]
["A part time person’s days need to be based on their scheduled hours per week. If a person’s scheduled hours per week is 10, the policy allots them 22, 2 hour days (10 hours a week over 5 work days = 2 hours per day). "]
["If, based on their actual work schedule, they used 24 hours then enter 10 days unused (44 total hours available (22 days * 2 hours per day) – 24 hours used = 20 hours. 20 hours across 2 hour days (20 hours/ 2 hours per day) = 10 days). "]
[]
[]
[]
["*Accrued time should not be added to this number. If a person borrowed against accrued time, please enter 0 unused days and note the number of borrowed days in the comments section."]

{"sheet":"Partial Month Calculation","index":5,"n_rows":11,"n_cols":4,"rows_kept":11,"cut":false,"hidden":false,"merged":[]}
["Partial Month Calculation (for Graduate Students Only):"]
["The calculation for a partial month is the full monthly amount divided by the number of working days per month (Monday - Friday including holidays) "]
["Multiply the answer by the number of workings days being paid to obtain the pay amount for the partial month. "]
["(Ex. using a start date of June 16, 2015 - 2351.67 / 22 = 106.89 * 11 = 1175.83)",null,"Enter Information in Yellow to Calculate"]
[]
[null,null,"Monthly Amount",3000]
[null,null,"Number of working days per month",20]
[null,null,"Number of working days being paid",10]
[]
[]
[null,null,"Partial Month Amount to enter",{"$f":"(D6/D7)*D8","v":1500}]

{"sheet":"All Data","index":6,"n_rows":434,"n_cols":8,"rows_kept":434,"cut":false,"hidden":false,"merged":[]}
["Action","Action+Category","Category","Required?"]
["Account Change",{"$f":"CONCATENATE(A2,C2)","v":"Account ChangeApprover(s)"},"Approver(s)","Yes"]
["Account Change","Account ChangeAssignment #","Assignment #","Yes"]
["Account Change","Account ChangeBegin Date","Begin Date","Yes"]
["Account Change","Account ChangeDart ID","Dart ID","Yes"]
["Account Change","Account ChangeEffective Date","Effective Date","Yes"]
["Account Change","Account ChangeFirst Name","First Name","Yes"]
["Account Change","Account ChangeFunding Information (GL or OGA)","Funding Information (GL or OGA)","Yes"]
["Account Change","Account ChangeiExpense Default Account","iExpense Default Account","Yes"]
["Account Change","Account ChangeIs this a graduate student?","Is this a graduate student?","Yes"]
["Account Change","Account ChangeLast Name","Last Name","Yes"]
["Account Change","Account ChangeMiddle Initial","Middle Initial","Yes"]
["Account Change","Account ChangeOrganization","Organization","Yes"]
["Account Change","Account ChangePeople Group","People Group","Yes"]
["Account Change","Account ChangeTitle","Title","Yes"]
{"$rows_left_out":420}
{"sheet":"Helpful Hints - All","index":7,"n_rows":243,"n_cols":16384,"rows_kept":243,"cut":false,"hidden":false,"merged":[]}
["Action ","Category","Action+Categ","Helpful Hint"]
["Account Change","Additional Helpful Information",{"$f":"CONCATENATE(A2,B2)","v":"Account ChangeAdditional Helpful Information"},"If this is a staff employee and there is only an account change, process the change via MYLS"]
["Account Change","Approver(s)","Account ChangeApprover(s)","List PA Approver(s) here"]
["Account Change","Begin Date","Account ChangeBegin Date","Should match the Effective Date"]
["Account Change","Comments (If you would like to provide any additional information)","Account ChangeComments (If you would like to provide any additional information)","Enter additional comments here"]
["Account Change","Date of Birth","Account ChangeDate of Birth","New Hires Only - DOBs should be entered in the e-Form or PASF directly in the appropriate listed fields - Never Email this information"]
["Account Change","Effective Date","Account ChangeEffective Date","Action effective date should be the date that the new account should go into effect"]
["Account Change","Funding Information (GL or OGA)","Account ChangeFunding Information (GL or OGA)","New funding information"]
["Account Change","iExpense default account","Account ChangeiExpense default account","GL Accounts Only"]
["Account Change","Last Day Worked","Account ChangeLast Day Worked","For Terminations Only"]
["Account Change","Middle Initial","Account ChangeMiddle Initial","Can leave blank if no middle initial listed in HRMS"]
["Account Change","Social Security Number","Account ChangeSocial Security Number","New Hires Only - SSNs should be entered in the e-Form or PASF directly in the appropriate listed fields - Never Email this information"]
["Account Change","Unused Vacation Days (Exempt ONLY)","Account ChangeUnused Vacation Days (Exempt ONLY)","For Terminations Only"]
["Additional Assignment","Approver(s)","Additional AssignmentApprover(s)","List PA Approver(s) here"]
["Additional Assignment","Begin Date","Additional AssignmentBegin Date","Should match the Effective Date"]
{"$rows_left_out":229}
{"sheet":"Drop Downs","index":8,"n_rows":196,"n_cols":12,"rows_kept":196,"cut":false,"hidden":false,"merged":[]}
["Actions","Gender","Reg/Temp","People Group","Grades","Yes/No","Termination Reasons","Payment Period","Payment Type","Work Arrangements","Timekeeping Locations","Citizenship"]
["Select An Action","Male ","Regular","Exempt Staff","Grade A","Yes","Cancellation","Annual","Regular Compensation","Onsite","100 - Payroll Office","United States"]
["Account Change","Female","Temporary","Exempt Student","Grade B","No","Chronic Abenteeism","Hourly","Commission","Remote","102 - Risk Management","Afghanistan"]
["Additional Assignment",null,null,"Faculty","Grade C",null,"Credential Revoked or denied","Monthly","Communication Stipend","Hybrid","103 - Records Management","Albania"]
["Additional Payments",null,null,"Fellow","Grade D",null,"Deceased","Total","Faculty Additional Pay (Non-Base)",null,"104 - Parking Operations","Algeria"]
["End Assignment",null,null,"Grandfathered","Grade D1",null,"Did not returned from LOA",null,"Faculty Base Pay",null,"105 - Validine System","Andorra"]
["FTE Change (Faculty, Research Assoc, or Fellow)",null,null,"IATSE","Grade E",null,"Dismissed for cause",null,"Graduate Student Stipend",null,"106 - Telephone Services","Angola"]
["Grade Change",null,null,"Non-Exempt Staff","Grade E1",null,"Employee Transfer",null,"Non-Exempt Student",null,"108 - Procurement Services Non Exempt","Antigua and Barbuda"]
["Hours Change",null,null,"Non-Exempt Student","Grade F",null,"End of Non-Paid Appointment",null,"Non-Faculty Additional Work Performed",null,"109 - Procurement Services - Exempt","Argentina"]
["New Hire",null,null,"Non-Union Service","Grade G",null,"End of Student Job",null,"Other \"Comments Required\"",null,"110 - Real Estate & Housing Programs Non Exempt","Armenia"]
["Organization Change",null,null,"Research Associate A","Grade H",null,"End of Temp Assignment",null,"Recognition/Discretionary/One-Time Additonal",null,"111 - Real Estate","Australia"]
["Promotion",null,null,"Research Associate B","Grade I",null,"End of Term Position",null,"Relocation/Signing Compensation",null,"112 - DDS","Austria"]
["Re-Hire",null,null,"Research Associate C","Grade J",null,"Failure to report to work",null,null,null,"114 - HR/Personnel","Azerbaijan"]
["Revised Pay Rate",null,null,"SEIU","Grade K",null,"Family Obligations",null,null,null,"115 - Fin Ctr Admin","Bahamas"]
["Special Rate",null,null,null,"Grade L",null,"Graduated",null,null,null,"118 - Courtyard Café","Bahrain"]
{"$rows_left_out":181}